Reaction Details
TargetDual specificity mitogen-activated protein kinase kinase 1
LigandBDBM50059889
Substrate/Competitorn/a
Meas. Tech.ChEMBL_123850 (CHEMBL731425)
IC50 2.5±n/a nM
Citation Tasdemir, DMallon, RGreenstein, MFeldberg, LRKim, SCCollins, KWojciechowicz, DMangalindan, GCConcepción, GPHarper, MKIreland, CM Aldisine alkaloids from the Philippine sponge Stylissa massa are potent inhibitors of mitogen-activated protein kinase kinase-1 (MEK-1). J Med Chem45:529-32 (2002) Dual specificity mitogen-activated protein kinase kinase 1
Name:Dual specificity mitogen-activated protein kinase kinase 1
Type:Other Protein Type
Mol. Mass.:43439.03
Organism:Homo sapiens (Human)
Description:Full-length human MEK-1 was generated by PCR and purified as a fusion protein from Escherichia coli lysates.
Residue:393
BDBM50059889
NameBDBM50059889
Synonyms:(staurosporine)3-methoxy-2-methyl-4-methylamino-(2S,3S,4S,6S)-29-oxa-1,7,17-triazaoctacyclo[12.12.2.12,6.07,28.08,13.015,19.020,27.021,26]nonacosa-8,10,12,14(28),15(19),20(27),21(26),22,24-nonaen-16-one 12-[3-methoxy-6-methyl-4-methylamino-(2S,3R,4R,6S)-tetrahydro-2H-2-pyranyl]-6,7,12,13-tetrahydro-5H-indolo[2,3-a]pyrrolo[3,4-c]carbazol-5-one 2-Amino-4-(2-amino-2-phenyl-ethyl)-6-(2-hydroxy-phenyl)-nicotinonitrile 3-methoxy-2-methyl-4-methylamino-(2R,3S,4S)-29-oxa-1,7,17-triazaoctacyclo[12.12.2.12,6.07,28.08,13.015,19.020,27.021,26]nonacosa-8,10,12,14(28),15(19),20(27),21(26),22,24-nonaen-16-one 3-methoxy-2-methyl-4-methylamino-(2R,3S,4S,6S)-29-oxa-1,7,17-triazaoctacyclo[12.12.2.12,6.07,28.08,13.015,19.020,27.021,26]nonacosa-8(13),9,11,14(28),15(19),20(27),21(26),22,24-nonaen-16-one(Staurosporine) 3-methoxy-2-methyl-4-methylamino-(2R,3S,4S,6S)-29-oxa-1,7,17-triazaoctacyclo[12.12.2.12,6.07,28.08,13.015,19.020,27.021,26]nonacosa-8(13),9,11,14,19,21(26),22,24,27-nonaen-16-one 3-methoxy-2-methyl-4-methylamino-(2S,3R,4R)-29-oxa-1,7,17-triazaoctacyclo[12.12.2.12,6.07,28.08,13.015,19.020,27.021,26]nonacosa-8(13),9,11,14(28),15(19),20(27),21(26),22,24-nonaen-16-one 3-methoxy-2-methyl-4-methylamino-(2S,3R,4R,6R)-29-oxa-1,7,17-triazaoctacyclo[12.12.2.12,6.07,28.08,13.015,19.020,27.021,26]nonacosa-8(13),9,11,14(28),15(19),20(27),21(26),22,24-nonaen-16-one 3-methoxy-2-methyl-4-methylamino-(2S,3S,4S,6R)-29-oxa-1,7,17-triazaoctacyclo[12.12.2.12,6.07,28.08,13.015,19.020,27.021,26]nonacosa-8(13),9,11,14(28),15(19),20(27),21,23,25-nonaen-16-one 3-methoxy-2-methyl-4-methylamino-29-oxa-1,7,17-triazaoctacyclo[12.12.2.12,6.07,28.08,13.015,19.020,27.021,26]nonacosa-8(13),9,11,14,19,21(26),22,24,27-nonaen-16-one 3-methoxy-4-methylamino-29-oxa-1,7,17-triazaoctacyclo[12.12.2.12,6.07,28.08,13.015,19.020,27.021,26]nonacosa-8(13),9,11,14(28),15(19),20(27),21(26),22,24-nonaen-16-one AM-2282 Indolocarbazole nitrogen derivative staurosporin
TypeSmall organic molecule
Emp. Form.C28H26N4O3
Mol. Mass.466.531
SMILESCN[C@@H]1CC2O[C@@](C)([C@@H]1OC)n1c3ccccc3c3c4CNC(=O)c4c4c5ccccc5n2c4c13