Reaction Details
TargetDelta-type opioid receptor
LigandBDBM50108791
Substrate/Competitorn/a
Meas. Tech.ChEMBL_145488 (CHEMBL752131)
Ki 2.7±n/a nM
Citation Srivastava, SKHusbands, SMAceto, MDMiller, CNTraynor, JRLewis, JW 4'-Arylpyrrolomorphinans: effect of a pyrrolo-N-benzyl substituent in enhancing delta-opioid antagonist activity. J Med Chem45:537-40 (2002) Delta-type opioid receptor
Name:Delta-type opioid receptor
Type:G Protein-Coupled Receptor (GPCR)
Mol. Mass.:40382.98
Organism:Homo sapiens (Human)
Description:Competition binding assays were carried out using membrane preparations from transfected HN9.10 cells that constitutively expressed the delta opioid receptor.
Residue:372
BDBM50108791
NameBDBM50108791
Synonyms:18-cyclopropylmethyl-5-phenyl-10-oxa-7,18-diazahexacyclo[9.9.1.01,9.02,17.04,8.015,21]henicosa-4(8),5,11,13,15(21)-pentaene-2,12-diol | CHEMBL436273
TypeSmall organic molecule
Emp. Form.C28H28N2O3
Mol. Mass.440.5335
SMILESOc1ccc2CC3N(CC4CC4)CC[C@@]45[C@@H](Oc1c24)c1[nH]cc(c1C[C@@]35O)-c1ccccc1