Reaction Details
TargetD(2) dopamine receptor
LigandBDBM50119377
Substrate/Competitorn/a
Meas. Tech.ChEMBL_61482 (CHEMBL672384)
Ki 110±n/a nM
Citation Bettinetti, LSchlotter, KHübner, HGmeiner, P Interactive SAR studies: rational discovery of super-potent and highly selective dopamine D3 receptor antagonists and partial agonists. J Med Chem45:4594-7 (2002) D(2) dopamine receptor
Name:D(2) dopamine receptor
Type:Cell-surface receptors
Mol. Mass.:50647.10
Organism:Homo sapiens (Human)
Description:P14416
Residue:443
BDBM50119377
NameBDBM50119377
Synonyms:Benzofuran-2-carboxylic acid {4-[4-(2-methoxy-phenyl)-piperazin-1-yl]-butyl}-amide N-(4-(4-(2-methoxyphenyl)piperazin-1-yl)butyl)benzofuran-2-carboxamide
TypeSmall organic molecule
Emp. Form.C24H29N3O3
Mol. Mass.407.5054
SMILESCOc1ccccc1N1CCN(CCCCNC(=O)c2cc3ccccc3o2)CC1