Reaction Details
TargetD(2) dopamine receptor
LigandBDBM50119392
Substrate/Competitorn/a
Meas. Tech.ChEMBL_61809 (CHEMBL672573)
Ki 140±n/a nM
Citation Bettinetti, LSchlotter, KHübner, HGmeiner, P Interactive SAR studies: rational discovery of super-potent and highly selective dopamine D3 receptor antagonists and partial agonists. J Med Chem45:4594-7 (2002) D(2) dopamine receptor
Name:D(2) dopamine receptor
Type:Cell-surface receptors
Mol. Mass.:50647.10
Organism:Homo sapiens (Human)
Description:P14416
Residue:443
BDBM50119392
NameBDBM50119392
Synonyms:CHEMBL141845 Pyrazolo[1,5-a]pyridine-3-carboxylic acid {2-[4-(2-methoxy-phenyl)-piperazin-1-yl]-ethyl}-amide
TypeSmall organic molecule
Emp. Form.C21H25N5O2
Mol. Mass.379.4555
SMILESCOc1ccccc1N1CCN(CCNC(=O)c2cnn3ccccc23)CC1