Reaction Details
TargetD(3) dopamine receptor
LigandBDBM50119377
Substrate/Competitorn/a
Meas. Tech.ChEMBL_61951 (CHEMBL671351)
EC50 1.5±n/a nM
Citation Bettinetti, LSchlotter, KHübner, HGmeiner, P Interactive SAR studies: rational discovery of super-potent and highly selective dopamine D3 receptor antagonists and partial agonists. J Med Chem45:4594-7 (2002) D(3) dopamine receptor
Name:D(3) dopamine receptor
Type:n/a
Mol. Mass.:44243.43
Organism:Homo sapiens (Human)
Description:n/a
Residue:400
BDBM50119377
NameBDBM50119377
Synonyms:Benzofuran-2-carboxylic acid {4-[4-(2-methoxy-phenyl)-piperazin-1-yl]-butyl}-amide N-(4-(4-(2-methoxyphenyl)piperazin-1-yl)butyl)benzofuran-2-carboxamide
TypeSmall organic molecule
Emp. Form.C24H29N3O3
Mol. Mass.407.5054
SMILESCOc1ccccc1N1CCN(CCCCNC(=O)c2cc3ccccc3o2)CC1