Reaction Details
TargetD(1A) dopamine receptor
LigandBDBM50119376
Substrate/Competitorn/a
Meas. Tech.ChEMBL_60507 (CHEMBL673336)
Ki 380±n/a nM
Citation Bettinetti, LSchlotter, KHübner, HGmeiner, P Interactive SAR studies: rational discovery of super-potent and highly selective dopamine D3 receptor antagonists and partial agonists. J Med Chem45:4594-7 (2002) D(1A) dopamine receptor
Name:D(1A) dopamine receptor
Type:Enzyme
Mol. Mass.:49303.43
Organism:Homo sapiens (Human)
Description:P21728
Residue:446
BDBM50119376
NameBDBM50119376
Synonyms:Benzo[b]tellurophene-2-carboxylic acid {4-[4-(2-methoxy-phenyl)-piperazin-1-yl]-butyl}-amide | CHEMBL141419
TypeSmall organic molecule
Emp. Form.C24H29N3O2Te
Mol. Mass.519.1
SMILESCOc1ccccc1N1CCN(CCCCNC(=O)C2=Cc3ccccc3[Te]2)CC1