Reaction Details
TargetD(1A) dopamine receptor
LigandBDBM50119392
Substrate/Competitorn/a
Meas. Tech.ChEMBL_60507 (CHEMBL673336)
Ki 1200±n/a nM
Citation Bettinetti, LSchlotter, KHübner, HGmeiner, P Interactive SAR studies: rational discovery of super-potent and highly selective dopamine D3 receptor antagonists and partial agonists. J Med Chem45:4594-7 (2002) D(1A) dopamine receptor
Name:D(1A) dopamine receptor
Type:Enzyme
Mol. Mass.:49303.43
Organism:Homo sapiens (Human)
Description:P21728
Residue:446
BDBM50119392
NameBDBM50119392
Synonyms:CHEMBL141845 Pyrazolo[1,5-a]pyridine-3-carboxylic acid {2-[4-(2-methoxy-phenyl)-piperazin-1-yl]-ethyl}-amide
TypeSmall organic molecule
Emp. Form.C21H25N5O2
Mol. Mass.379.4555
SMILESCOc1ccccc1N1CCN(CCNC(=O)c2cnn3ccccc23)CC1