Reaction Details
TargetAdenosine receptor A1
LigandBDBM50094592
Substrate/Competitorn/a
Meas. Tech.ChEMBL_29113 (CHEMBL638725)
Ki 600±n/a nM
Citation Bondavalli, FBotta, MBruno, OCiacci, ACorelli, FFossa, PLucacchini, AManetti, FMartini, CMenozzi, GMosti, LRanise, ASchenone, STafi, ATrincavellic, ML Synthesis, molecular modeling studies, and pharmacological activity of selective A(1) receptor antagonists. J Med Chem45:4875-87 (2002) Adenosine receptor A1
Name:Adenosine receptor A1
Type:Enzyme Catalytic Domain
Mol. Mass.:36602.99
Organism:BOVINE
Description:ADENOSINE 0 BOVINE::P28190
Residue:326
BDBM50094592
NameBDBM50094592
Synonyms:9-Phenyl-2-pyridin-4-yl-6,7,8,9-tetrahydro-5H-1,3,9-triaza-fluoren-4-ylamine | CHEMBL142587
TypeSmall organic molecule
Emp. Form.C21H19N5
Mol. Mass.341.4091
SMILESNc1nc(nc2n(c3CCCCc3c12)-c1ccccc1)-c1ccncc1