Reaction Details
TargetAdenosine receptor A1
LigandBDBM50104334
Substrate/Competitorn/a
Meas. Tech.ChEMBL_29117 (CHEMBL638729)
Ki 50±n/a nM
Citation Bondavalli, FBotta, MBruno, OCiacci, ACorelli, FFossa, PLucacchini, AManetti, FMartini, CMenozzi, GMosti, LRanise, ASchenone, STafi, ATrincavellic, ML Synthesis, molecular modeling studies, and pharmacological activity of selective A(1) receptor antagonists. J Med Chem45:4875-87 (2002) Adenosine receptor A1
Name:Adenosine receptor A1
Type:Enzyme Catalytic Domain
Mol. Mass.:36602.99
Organism:BOVINE
Description:ADENOSINE 0 BOVINE::P28190
Residue:326
BDBM50104334
NameBDBM50104334
Synonyms:1-(2-Chloro-2-phenyl-ethyl)-4-phenethylamino-1H-pyrazolo[3,4-b]pyridine-5-carboxylic acid ethyl ester ethyl 1-(2-chloro-2-phenylethyl)-4-(phenethylamino)-1H-pyrazolo[3,4-b]pyridine-5-carboxylate
TypeSmall organic molecule
Emp. Form.C25H25ClN4O2
Mol. Mass.448.945
SMILESCCOC(=O)c1cnc2n(CC(Cl)c3ccccc3)ncc2c1NCCc1ccccc1