Reaction Details
TargetAdenosine receptor A1
LigandBDBM50104332
Substrate/Competitorn/a
Meas. Tech.ChEMBL_29126 (CHEMBL642430)
Ki 4100±n/a nM
Citation Bondavalli, FBotta, MBruno, OCiacci, ACorelli, FFossa, PLucacchini, AManetti, FMartini, CMenozzi, GMosti, LRanise, ASchenone, STafi, ATrincavellic, ML Synthesis, molecular modeling studies, and pharmacological activity of selective A(1) receptor antagonists. J Med Chem45:4875-87 (2002) Adenosine receptor A1
Name:Adenosine receptor A1
Type:Enzyme Catalytic Domain
Mol. Mass.:36602.99
Organism:BOVINE
Description:ADENOSINE 0 BOVINE::P28190
Residue:326
BDBM50104332
NameBDBM50104332
Synonyms:4-Butylamino-1-(2-chloro-2-phenyl-ethyl)-1H-pyrazolo[3,4-b]pyridine-5-carboxylic acid ethyl ester | CHEMBL85195
TypeSmall organic molecule
Emp. Form.C21H25ClN4O2
Mol. Mass.400.902
SMILESCCCCNc1c(cnc2n(CC(Cl)c3ccccc3)ncc12)C(=O)OCC