Reaction Details
TargetDihydrofolate reductase
LigandBDBM18050
Substrate/Competitorn/a
Meas. Tech.ChEMBL_54739 (CHEMBL667190)
IC50 6±n/a nM
Citation Gangjee, AZeng, YMcGuire, JJKisliuk, RL Synthesis of classical and nonclassical, partially restricted, linear, tricyclic 5-deaza antifolates. J Med Chem45:5173-81 (2002) Dihydrofolate reductase
Name:Dihydrofolate reductase
Type:n/a
Mol. Mass.:17532.46
Organism:Escherichia coli
Description:n/a
Residue:157
BDBM18050
NameBDBM18050
Synonyms:2-[(4-{[(2,4-diaminopteridin-6-yl)methyl](methyl)amino}phenyl)formamido]pentanedioic acid MTX cid_126941
TypeSmall organic molecule
Emp. Form.C20H22N8O5
Mol. Mass.454.4393
SMILESCN(Cc1cnc2nc(N)nc(N)c2n1)c1ccc(cc1)C(=O)N[C@@H](CCC(O)=O)C(O)=O