Reaction Details
TargetDelta-type opioid receptor
LigandBDBM50121312
Substrate/Competitorn/a
Meas. Tech.ChEMBL_145480 (CHEMBL752896)
Ki 5200±n/a nM
Citation Halab, LBecker, JADarula, ZTourwé, DKieffer, BLSimonin, FLubell, WD Probing opioid receptor interactions with azacycloalkane amino acids. Synthesis of a potent and selective ORL1 antagonist. J Med Chem45:5353-7 (2002) Delta-type opioid receptor
Name:Delta-type opioid receptor
Type:G Protein-Coupled Receptor (GPCR)
Mol. Mass.:40382.98
Organism:Homo sapiens (Human)
Description:Competition binding assays were carried out using membrane preparations from transfected HN9.10 cells that constitutively expressed the delta opioid receptor.
Residue:372
BDBM50121312
NameBDBM50121312
Synonyms:Ac-Arg-D-Cha-I2aa-D-Arg-D-pClPhe-NH2 | CHEMBL266609
TypeSmall organic molecule
Emp. Form.C40H62ClN13O7S
Mol. Mass.904.521
SMILESCC(=O)N[C@@H](CCCNC(N)=N)C(=O)N[C@@H](CC1CCCCC1)C(=O)N[C@H]1CC[C@H]2SC[C@H](N2C1=O)C(=O)N[C@H](CCCNC(N)=N)C(=O)NC(Cc1ccc(Cl)cc1)C(N)=O