Reaction Details
TargetNociceptin receptor
LigandBDBM50121313
Substrate/Competitorn/a
Meas. Tech.ChEMBL_146108 (CHEMBL754578)
Ki 35±n/a nM
Citation Halab, LBecker, JADarula, ZTourwé, DKieffer, BLSimonin, FLubell, WD Probing opioid receptor interactions with azacycloalkane amino acids. Synthesis of a potent and selective ORL1 antagonist. J Med Chem45:5353-7 (2002) Nociceptin receptor
Name:Nociceptin receptor
Type:G Protein-Coupled Receptor (GPCR)
Mol. Mass.:40702.87
Organism:Homo sapiens (Human)
Description:P41146
Residue:370
BDBM50121313
NameBDBM50121313
Synonyms:Ac-Arg-D-Cha-Qaa-D-Arg-D-pClPhe-NH2 | CHEMBL355931
TypeSmall organic molecule
Emp. Form.C42H66ClN13O7
Mol. Mass.900.509
SMILESCC(=O)N[C@@H](CCCNC(N)=N)C(=O)N[C@@H](CC1CCCCC1)C(=O)NC1CC[C@H]2CCC[C@H](N2C1=O)C(=O)N[C@H](CCCNC(N)=N)C(=O)NC(Cc1ccc(Cl)cc1)C(N)=O