Reaction Details
TargetMu-type opioid receptor
LigandBDBM50121312
Substrate/Competitorn/a
Meas. Tech.ChEMBL_145592 (CHEMBL749737)
EC50 1400±n/a nM
Citation Halab, LBecker, JADarula, ZTourwé, DKieffer, BLSimonin, FLubell, WD Probing opioid receptor interactions with azacycloalkane amino acids. Synthesis of a potent and selective ORL1 antagonist. J Med Chem45:5353-7 (2002) Mu-type opioid receptor
Name:Mu-type opioid receptor
Type:G Protein-Coupled Receptor (GPCR)
Mol. Mass.:44789.51
Organism:Homo sapiens (Human)
Description:P35372
Residue:400
BDBM50121312
NameBDBM50121312
Synonyms:Ac-Arg-D-Cha-I2aa-D-Arg-D-pClPhe-NH2 | CHEMBL266609
TypeSmall organic molecule
Emp. Form.C40H62ClN13O7S
Mol. Mass.904.521
SMILESCC(=O)N[C@@H](CCCNC(N)=N)C(=O)N[C@@H](CC1CCCCC1)C(=O)N[C@H]1CC[C@H]2SC[C@H](N2C1=O)C(=O)N[C@H](CCCNC(N)=N)C(=O)NC(Cc1ccc(Cl)cc1)C(N)=O