Reaction Details
TargetKappa-type opioid receptor
LigandBDBM50121316
Substrate/Competitorn/a
Meas. Tech.ChEMBL_147244 (CHEMBL755512)
Ki 78±n/a nM
Citation Halab, LBecker, JADarula, ZTourwé, DKieffer, BLSimonin, FLubell, WD Probing opioid receptor interactions with azacycloalkane amino acids. Synthesis of a potent and selective ORL1 antagonist. J Med Chem45:5353-7 (2002) Kappa-type opioid receptor
Name:Kappa-type opioid receptor
Type:G Protein-Coupled Receptor (GPCR)
Mol. Mass.:42648.76
Organism:Homo sapiens (Human)
Description:P41145
Residue:380
BDBM50121316
NameBDBM50121316
Synonyms:Ac-Arg-D-Cha-BTD-D-Arg-D-pClPhe-NH2 | CHEMBL358403
TypeSmall organic molecule
Emp. Form.C40H62ClN13O7S
Mol. Mass.904.521
SMILESCC(=O)N[C@@H](CCCNC(N)=N)C(=O)N[C@@H](CC1CCCCC1)C(=O)N[C@H]1CC[C@@H]2SC[C@@H](N2C1=O)C(=O)N[C@H](CCCNC(N)=N)C(=O)NC(Cc1ccc(Cl)cc1)C(N)=O