Reaction Details
TargetGag-Pol polyprotein [489-587]
LigandBDBM50121514
Substrate/Competitorn/a
Meas. Tech.ChEMBL_158026 (CHEMBL768619)
Ki 660±n/a nM
Kd 1.3±n/a nM
KON 348000 M-1s-1
Citation Markgren, POSchaal, WHämäläinen, MKarlén, AHallberg, ASamuelsson, BDanielson, UH Relationships between structure and interaction kinetics for HIV-1 protease inhibitors. J Med Chem45:5430-9 (2002) Gag-Pol polyprotein [489-587]
Name:Gag-Pol polyprotein [489-587]
Type:Enzyme Subunit
Mol. Mass.:10781.16
Organism:Human immunodeficiency virus type 1
Description:P04585[489-587]
Residue:99
BDBM50121514
NameBDBM50121514
Synonyms:2-({2,5-Bis-benzyloxy-5-[(1-carboxy-3-methylsulfanyl-propyl)-methyl-carbamoyl]-3,4-dihydroxy-pentanoyl}-methyl-amino)-4-methylsulfanyl-butyric acid | CHEMBL356015
TypeSmall organic molecule
Emp. Form.C32H44N2O10S2
Mol. Mass.680.829
SMILESCSCCC(N(C)C(=O)[C@H](OCc1ccccc1)[C@H](O)[C@@H](O)[C@@H](OCc1ccccc1)C(=O)N(C)C(CCSC)C(O)=O)C(O)=O