Reaction Details
TargetGag-Pol polyprotein [489-587]
LigandBDBM50121520
Substrate/Competitorn/a
Meas. Tech.ChEMBL_158026 (CHEMBL768619)
Ki 570±n/a nM
Citation Markgren, POSchaal, WHämäläinen, MKarlén, AHallberg, ASamuelsson, BDanielson, UH Relationships between structure and interaction kinetics for HIV-1 protease inhibitors. J Med Chem45:5430-9 (2002) Gag-Pol polyprotein [489-587]
Name:Gag-Pol polyprotein [489-587]
Type:Enzyme Subunit
Mol. Mass.:10781.16
Organism:Human immunodeficiency virus type 1
Description:P04585[489-587]
Residue:99
BDBM50121520
NameBDBM50121520
Synonyms:1,3-Dibenzyl-5,6-dihydroxy-4,7-diphenethyl-[1,3]diazepan-2-one | CHEMBL150601
TypeSmall organic molecule
Emp. Form.C35H38N2O3
Mol. Mass.534.6878
SMILESO[C@@H]1[C@@H](O)C(CCc2ccccc2)N(Cc2ccccc2)C(=O)N(Cc2ccccc2)C1CCc1ccccc1