Reaction Details
TargetGag-Pol polyprotein [489-587]
LigandBDBM327
Substrate/Competitorn/a
Meas. Tech.ChEMBL_158026 (CHEMBL768619)
Ki 93±n/a nM
Citation Markgren, POSchaal, WHämäläinen, MKarlén, AHallberg, ASamuelsson, BDanielson, UH Relationships between structure and interaction kinetics for HIV-1 protease inhibitors. J Med Chem45:5430-9 (2002) Gag-Pol polyprotein [489-587]
Name:Gag-Pol polyprotein [489-587]
Type:Enzyme Subunit
Mol. Mass.:10781.16
Organism:Human immunodeficiency virus type 1
Description:P04585[489-587]
Residue:99
BDBM327
NameBDBM327
Synonyms:(3R,4S,5S,6R)-2,7-Bis[3-Iodobenzyl]-3,6-bis(phenoxymethyl)-4,5-dihydroxy-1,2,7-thiadiazepine 1,1-Dioxide CHEMBL439636 | Cyclic Sulfamide deriv. 5
TypeSmall organic molecule
Emp. Form.C32H32I2N2O6S
Mol. Mass.826.48
SMILESO[C@@H]1[C@@H](O)[C@@H](COc2ccccc2)N(Cc2cccc(I)c2)S(=O)(=O)N(Cc2cccc(I)c2)[C@@H]1COc1ccccc1