Reaction Details
TargetDelta-type opioid receptor
LigandBDBM50121645
Substrate/Competitorn/a
Meas. Tech.ChEMBL_122682 (CHEMBL733564)
IC50 0.026±n/a nM
Citation Balboni, GSalvadori, SGuerrini, RNegri, LGiannini, EJinsmaa, YBryant, SDLazarus, LH Potent delta-opioid receptor agonists containing the Dmt-Tic pharmacophore. J Med Chem45:5556-63 (2002) Delta-type opioid receptor
Name:Delta-type opioid receptor
Type:Enzyme Catalytic Domain
Mol. Mass.:40577.25
Organism:MOUSE
Description:P32300
Residue:372
BDBM50121645
NameBDBM50121645
Synonyms:2-[(2S)-2-amino-3-(4-hydroxy-2,6-dimethylphenyl)propanoyl]-N-[(1S)-1-(1H-1,3-benzodiazol-2-yl)ethyl]-1,2,3,4-tetrahydroisoquinoline-3-carboxamide | 2-[2-Amino-3-(4-hydroxy-2,6-dimethyl-phenyl)-propionyl]-1,2,3,4-tetrahydro-isoquinoline-3-carboxylic acid [1-(1H-benzoimidazol-2-yl)-ethyl]-amide
TypeSmall organic molecule
Emp. Form.C30H33N5O3
Mol. Mass.511.6147
SMILESC[C@H](NC(=O)C1Cc2ccccc2CN1C(=O)[C@@H](N)Cc1c(C)cc(O)cc1C)c1nc2ccccc2[nH]1