Reaction Details
TargetDelta-type opioid receptor
LigandBDBM50121648
Substrate/Competitorn/a
Meas. Tech.ChEMBL_147039 (CHEMBL753342)
Ki 0.042±n/a nM
Citation Balboni, GSalvadori, SGuerrini, RNegri, LGiannini, EJinsmaa, YBryant, SDLazarus, LH Potent delta-opioid receptor agonists containing the Dmt-Tic pharmacophore. J Med Chem45:5556-63 (2002) Delta-type opioid receptor
Name:Delta-type opioid receptor
Type:G Protein-Coupled Receptor (GPCR)
Mol. Mass.:40465.04
Organism:Rattus norvegicus (rat)
Description:Competition binding assays were using CHO-K1 cell membranes expressing the opioid receptor.
Residue:372
BDBM50121648
NameBDBM50121648
Synonyms:2-({2-[2-Amino-3-(4-hydroxy-2,6-dimethyl-phenyl)-propionyl]-1,2,3,4-tetrahydro-isoquinoline-3-carbonyl}-amino)-3-(1H-benzoimidazol-2-yl)-propionic acid
TypeSmall organic molecule
Emp. Form.C31H33N5O5
Mol. Mass.555.6242
SMILESCc1cc(O)cc(C)c1C[C@H](N)C(=O)N1Cc2ccccc2CC1C(=O)N[C@@H](Cc1nc2ccccc2[nH]1)C(O)=O