Reaction Details
TargetSomatostatin receptor type 1
LigandBDBM50103430
Substrate/Competitorn/a
Meas. Tech.ChEMBL_200542 (CHEMBL805046)
Ki 2392±n/a nM
Citation Patchett, AA 2002 Alfred Burger Award Address in Medicinal Chemistry. Natural products and design: interrelated approaches in drug discovery. J Med Chem45:5609-16 (2002) Somatostatin receptor type 1
Name:Somatostatin receptor type 1
Type:Enzyme
Mol. Mass.:42692.81
Organism:Homo sapiens (Human)
Description:P30872
Residue:391
BDBM50103430
NameBDBM50103430
Synonyms:6-Amino-2-(3-(1H-indol-3-yl)-2-{[4-(2-oxo-2,3-dihydro-benzoimidazol-1-yl)-piperidine-1-carbonyl]-amino}-butyrylamino)-hexanoic acid tert-butyl ester | CHEMBL99895
TypeSmall organic molecule
Emp. Form.C35H47N7O5
Mol. Mass.645.7916
SMILESC[C@H]([C@@H](NC(=O)N1CCC(CC1)n1c2ccccc2[nH]c1=O)C(=O)N[C@@H](CCCCN)C(=O)OC(C)(C)C)c1c[nH]c2ccccc12