Reaction Details
TargetATP-dependent translocase ABCB1
LigandBDBM50246936
Substrate/Competitorn/a
Meas. Tech.ChEMBL_147863 (CHEMBL754774)
Ki 170000±n/a nM
Citation Pajeva, IKWiese, M Pharmacophore model of drugs involved in P-glycoprotein multidrug resistance: explanation of structural variety (hypothesis). J Med Chem45:5671-86 (2002) ATP-dependent translocase ABCB1
Name:ATP-dependent translocase ABCB1
Type:Protein
Mol. Mass.:141503.50
Organism:Homo sapiens (Human)
Description:P08183
Residue:1280
BDBM50246936
NameBDBM50246936
Synonyms:(-)-(S)-Propranolol CHEMBL452861 S-(-)-propanolol | [2-Hydroxy-3-(naphthalen-1-yloxy)-propyl]-isopropyl-ammonium((-)-propranolol)
TypeSmall organic molecule
Emp. Form.C16H21NO2
Mol. Mass.259.3434
SMILESCC(C)NC[C@H](O)COc1cccc2ccccc12