Reaction Details
TargetATP-dependent translocase ABCB1
LigandBDBM18957
Substrate/Competitorn/a
Meas. Tech.ChEMBL_147863 (CHEMBL754774)
Ki 3200±n/a nM
Citation Pajeva, IKWiese, M Pharmacophore model of drugs involved in P-glycoprotein multidrug resistance: explanation of structural variety (hypothesis). J Med Chem45:5671-86 (2002) ATP-dependent translocase ABCB1
Name:ATP-dependent translocase ABCB1
Type:Protein
Mol. Mass.:141503.50
Organism:Homo sapiens (Human)
Description:P08183
Residue:1280
BDBM18957
NameBDBM18957
Synonyms:(2-{4-[(2-butyl-1-benzofuran-3-yl)carbonyl]-2,6-diiodophenoxy}ethyl)diethylamine Amiodarone Cordarone cid_441325
TypeSmall organic molecule
Emp. Form.C25H29I2NO3
Mol. Mass.645.3116
SMILESCCCCc1oc2ccccc2c1C(=O)c1cc(I)c(OCCN(CC)CC)c(I)c1