Reaction Details
TargetATP-dependent translocase ABCB1
LigandBDBM36108
Substrate/Competitorn/a
Meas. Tech.ChEMBL_147865 (CHEMBL755181)
IC50 583000±n/a nM
Citation Pajeva, IKWiese, M Pharmacophore model of drugs involved in P-glycoprotein multidrug resistance: explanation of structural variety (hypothesis). J Med Chem45:5671-86 (2002) ATP-dependent translocase ABCB1
Name:ATP-dependent translocase ABCB1
Type:Protein
Mol. Mass.:141503.50
Organism:Homo sapiens (Human)
Description:P08183
Residue:1280
BDBM36108
NameBDBM36108
Synonyms:(R)-propranolol
TypeGuest
Emp. Form.C16H22NO2
Mol. Mass.260.3508
SMILESCC(C)[NH2+]C[C@@H](O)COc1cccc2ccccc12