Reaction Details
TargetATP-dependent translocase ABCB1
LigandBDBM50005628
Substrate/Competitorn/a
Meas. Tech.ChEMBL_147865 (CHEMBL755181)
IC50 2090±n/a nM
Citation Pajeva, IKWiese, M Pharmacophore model of drugs involved in P-glycoprotein multidrug resistance: explanation of structural variety (hypothesis). J Med Chem45:5671-86 (2002) ATP-dependent translocase ABCB1
Name:ATP-dependent translocase ABCB1
Type:Protein
Mol. Mass.:141503.50
Organism:Homo sapiens (Human)
Description:P08183
Residue:1280
BDBM50005628
NameBDBM50005628
Synonyms:(S) Verapamil 2-(3,4-Dimethoxy-phenyl)-5-{[2-(3,4-dimethoxy-phenyl)-ethyl]-methyl-amino}-2-isopropyl-pentanenitrile CHEMBL36148 verapamil-S
TypeSmall organic molecule
Emp. Form.C27H38N2O4
Mol. Mass.454.6016
SMILESCOc1ccc(CCN(C)CCC[C@](C#N)(C(C)C)c2ccc(OC)c(OC)c2)cc1OC