Reaction Details
TargetATP-dependent translocase ABCB1
LigandBDBM50121975
Substrate/Competitorn/a
Meas. Tech.ChEMBL_147863 (CHEMBL754774)
Ki 5000±n/a nM
Citation Pajeva, IKWiese, M Pharmacophore model of drugs involved in P-glycoprotein multidrug resistance: explanation of structural variety (hypothesis). J Med Chem45:5671-86 (2002) ATP-dependent translocase ABCB1
Name:ATP-dependent translocase ABCB1
Type:Protein
Mol. Mass.:141503.50
Organism:Homo sapiens (Human)
Description:P08183
Residue:1280
BDBM50121975
NameBDBM50121975
Synonyms:(6-Methoxy-quinolin-4-yl)-(5-vinyl-1-aza-bicyclo[2.2.2]oct-2-yl)-methanol CHEMBL1294 DURAQUIN QUINAGLUTE QUINATIME QUINIDINE US9402878, Quinidine
TypeSmall organic molecule
Emp. Form.C20H24N2O2
Mol. Mass.324.4168
SMILESCOc1ccc2nccc([C@H](O)[C@H]3C[C@@H]4CCN3C[C@@H]4C=C)c2c1