Reaction Details
TargetD(4) dopamine receptor
LigandBDBM50122044
Substrate/Competitorn/a
Meas. Tech.ChEMBL_60680 (CHEMBL675942)
Ki 3.95±n/a nM
Citation Leopoldo, MBerardi, FColabufo, NADe Giorgio, PLacivita, EPerrone, RTortorella, V Structure-affinity relationship study on N-[4-(4-arylpiperazin-1-yl)butyl]arylcarboxamides as potent and selective dopamine D(3) receptor ligands. J Med Chem45:5727-35 (2002) D(4) dopamine receptor
Name:D(4) dopamine receptor
Type:Enzyme
Mol. Mass.:48373.19
Organism:Homo sapiens (Human)
Description:P21917
Residue:419
BDBM50122044
NameBDBM50122044
Synonyms:CHEMBL345111 | N-{2-[4-(5-Chloro-pyridin-2-yl)-piperazin-1-yl]-ethyl}-3-methoxy-benzamide
TypeSmall organic molecule
Emp. Form.C19H23ClN4O2
Mol. Mass.374.865
SMILESCOc1cccc(c1)C(=O)NCCN1CCN(CC1)c1ccc(Cl)cn1