Reaction Details
TargetDelta-type opioid receptor
LigandBDBM50240679
Substrate/Competitorn/a
Meas. Tech.ChEMBL_146919 (CHEMBL757507)
Ki 0.440±n/a nM
Citation Balboni, GGuerrini, RSalvadori, SBianchi, CRizzi, DBryant, SDLazarus, LH Evaluation of the Dmt-Tic pharmacophore: conversion of a potent delta-opioid receptor antagonist into a potent delta agonist and ligands with mixed properties. J Med Chem45:713-20 (2002) Delta-type opioid receptor
Name:Delta-type opioid receptor
Type:G Protein-Coupled Receptor (GPCR)
Mol. Mass.:40465.04
Organism:Rattus norvegicus (rat)
Description:Competition binding assays were using CHO-K1 cell membranes expressing the opioid receptor.
Residue:372
BDBM50240679
NameBDBM50240679
Synonyms:2-Amino-3-(4-hydroxy-2,6-dimethyl-phenyl)-1-(3-hydroxymethyl-3,4-dihydro-1H-isoquinolin-2-yl)-propan-1-one CHEMBL328135
TypeSmall organic molecule
Emp. Form.C21H26N2O3
Mol. Mass.354.4427
SMILESCc1cc(O)cc(C)c1C[C@H](N)C(=O)N1Cc2ccccc2CC1CO