Reaction Details
TargetNeuronal acetylcholine receptor subunit alpha-4/beta-2
LigandBDBM50110258
Substrate/Competitorn/a
Meas. Tech.ChEMBL_143727 (CHEMBL756123)
Ki 0.04±n/a nM
Citation Gohlke, HGündisch, DSchwarz, SSeitz, GTilotta, MCWegge, T Synthesis and nicotinic binding studies on enantiopure diazine analogues of the novel (2-chloro-5-pyridyl)-9-azabicyclo[4.2.1]non-2-ene UB-165. J Med Chem45:1064-72 (2002) Neuronal acetylcholine receptor subunit alpha-4/beta-2
Name:Neuronal acetylcholine receptor subunit alpha-4/beta-2
Type:n/a
Mol. Mass.:n/a
Description:n/a
Components:This complex has 0 components.
Component 1
Name:Neuronal acetylcholine receptor subunit alpha-4
Synonyms:ACHA4_RAT Cholinergic, Nicotinic Alpha4Beta2 Chrna4 Neuronal acetylcholine receptor (alpha4beta2 nAChR) Neuronal acetylcholine receptor subunit alpha 4 beta 2 | Neuronal acetylcholine receptor subunit alpha-4
Type:Enzyme
Mol. Mass.:70196.44
Organism:Rattus norvegicus (Rat)
Description:P09483
Residue:630
Component 2
Name:Neuronal acetylcholine receptor subunit beta-2
Synonyms:ACHB2_RAT Chrnb2 Neuronal acetylcholine receptor non-alpha-1 chain
Type:Enzyme
Mol. Mass.:56910.32
Organism:Rattus norvegicus (Rat)
Description:P12390
Residue:500
BDBM50110258
NameBDBM50110258
Synonyms:(6S)-2-(6-chloropyridin-3-yl)-9-azabicyclo[4.2.1]non-2-ene 2-(6-Chloro-pyridin-3-yl)-9-aza-bicyclo[4.2.1]non-2-ene(UB-165) | CHEMBL275466
TypeSmall organic molecule
Emp. Form.C13H15ClN2
Mol. Mass.234.725
SMILESClc1ccc(cn1)C1=CCC[C@H]2CCC1N2