Reaction Details
TargetNeuronal acetylcholine receptor subunit beta-4
LigandBDBM50110260
Substrate/Competitorn/a
Meas. Tech.ChEMBL_143393 (CHEMBL750860)
Ki 6.2±n/a nM
Citation Gohlke, HGündisch, DSchwarz, SSeitz, GTilotta, MCWegge, T Synthesis and nicotinic binding studies on enantiopure diazine analogues of the novel (2-chloro-5-pyridyl)-9-azabicyclo[4.2.1]non-2-ene UB-165. J Med Chem45:1064-72 (2002) Neuronal acetylcholine receptor subunit beta-4
Name:Neuronal acetylcholine receptor subunit beta-4
Type:Enzyme
Mol. Mass.:55863.89
Organism:Rattus norvegicus (Rat)
Description:P12392
Residue:495
BDBM50110260
NameBDBM50110260
Synonyms:2-Pyridin-3-yl-9-aza-bicyclo[4.2.1]non-2-ene CHEMBL274538
TypeSmall organic molecule
Emp. Form.C13H16N2
Mol. Mass.200.2795
SMILESC1CC2N[C@H]1CCC=C2c1cccnc1