Reaction Details
TargetAmine oxidase [flavin-containing] B
LigandBDBM50110717
Substrate/Competitorn/a
Meas. Tech.ChEMBL_123738 (CHEMBL728381)
Ki 200000±n/a nM
Citation Mai, AArtico, MEsposito, MSbardella, GMassa, SBefani, OTurini, PGiovannini, VMondovì, B 3-(1H-Pyrrol-1-yl)-2-oxazolidinones as reversible, highly potent, and selective inhibitors of monoamine oxidase type A. J Med Chem45:1180-3 (2002) Amine oxidase [flavin-containing] B
Name:Amine oxidase [flavin-containing] B
Type:PROTEIN
Mol. Mass.:58428.94
Organism:Bos taurus
Description:ChEMBL_1501478
Residue:520
BDBM50110717
NameBDBM50110717
Synonyms:5-Azidomethyl-3-pyrrol-1-yl-oxazolidin-2-one | CHEMBL18019
TypeSmall organic molecule
Emp. Form.C8H9N5O2
Mol. Mass.207.1894
SMILES[N-]=[N+]=NC[C@H]1CN(C(=O)O1)n1cccc1