Reaction Details
TargetAmine oxidase [flavin-containing] B
LigandBDBM50110723
Substrate/Competitorn/a
Meas. Tech.ChEMBL_123738 (CHEMBL728381)
Ki 23000±n/a nM
Citation Mai, AArtico, MEsposito, MSbardella, GMassa, SBefani, OTurini, PGiovannini, VMondovì, B 3-(1H-Pyrrol-1-yl)-2-oxazolidinones as reversible, highly potent, and selective inhibitors of monoamine oxidase type A. J Med Chem45:1180-3 (2002) Amine oxidase [flavin-containing] B
Name:Amine oxidase [flavin-containing] B
Type:PROTEIN
Mol. Mass.:58428.94
Organism:Bos taurus
Description:ChEMBL_1501478
Residue:520
BDBM50110723
NameBDBM50110723
Synonyms:5-Methoxymethyl-3-pyrrol-1-yl-oxazolidin-2-one | CHEMBL18390
TypeSmall organic molecule
Emp. Form.C9H12N2O3
Mol. Mass.196.2032
SMILESCOC[C@@H]1CN(C(=O)O1)n1cccc1