Reaction Details
TargetTyrosine-protein kinase Lck
LigandBDBM50111444
Substrate/Competitorn/a
Meas. Tech.ChEMBL_221491 (CHEMBL842077)
Kd 1000±n/a nM
Citation Toogood, PL Inhibition of protein-protein association by small molecules: approaches and progress. J Med Chem45:1543-58 (2002) Tyrosine-protein kinase Lck
Name:Tyrosine-protein kinase Lck
Type:n/a
Mol. Mass.:57987.83
Organism:Homo sapiens (Human)
Description:P06239
Residue:509
BDBM50111444
NameBDBM50111444
Synonyms:2-{4-[2-[1-(4-Methoxy-benzyl)-4-methyl-2-oxo-1,2-dihydro-pyridin-3-ylcarbamoyl]-2-(2-methyl-2-naphthalen-2-yl-propionylamino)-ethyl]-phenyl}-2-methyl-propionic acid | CHEMBL411464
TypeSmall organic molecule
Emp. Form.C41H43N3O6
Mol. Mass.673.7966
SMILESCOc1ccc(Cn2ccc(C)c(NC(=O)[C@H](Cc3ccc(cc3)C(C)(C)C(O)=O)NC(=O)C(C)(C)c3ccc4ccccc4c3)c2=O)cc1