Reaction Details
TargetCannabinoid receptor 1
LigandBDBM50080103
Substrate/Competitorn/a
Meas. Tech.ChEMBL_46460 (CHEMBL657907)
Ki 70.3±n/a nM
Citation Ooms, FWouters, JOscari, OHappaerts, TBouchard, GCarrupt, PATesta, BLambert, DM Exploration of the pharmacophore of 3-alkyl-5-arylimidazolidinediones as new CB(1) cannabinoid receptor ligands and potential antagonists: synthesis, lipophilicity, affinity, and molecular modeling. J Med Chem45:1748-56 (2002) Cannabinoid receptor 1
Name:Cannabinoid receptor 1
Type:G Protein-Coupled Receptor (GPCR)
Mol. Mass.:52868.96
Organism:Homo sapiens (Human)
Description:P21554
Residue:472
BDBM50080103
NameBDBM50080103
Synonyms:5,5-Bis-(4-bromo-phenyl)-3-(2-morpholin-4-yl-ethyl)-imidazolidine-2,4-dione CHEMBL50925
TypeSmall organic molecule
Emp. Form.C21H21Br2N3O3
Mol. Mass.523.218
SMILESBrc1ccc(cc1)C1(NC(=O)N(CCN2CCOCC2)C1=O)c1ccc(Br)cc1