Reaction Details
TargetSodium-dependent dopamine transporter
LigandBDBM50112273
Substrate/Competitorn/a
Meas. Tech.ChEMBL_62318 (CHEMBL673607)
Ki 5530±n/a nM
Citation Zhang, AZhou, GHoepping, AMukhopadhyaya, JJohnson, KMZhang, MKozikowski, AP Further studies on conformationally constrained tricyclic tropane analogues and their uptake inhibition at monoamine transporter sites: synthesis of (Z)-9-(substituted arylmethylene)-7-azatricyclo[4.3.1.0(3,7)]decanes as a novel class of serotonin transporter inhibitors. J Med Chem45:1930-41 (2002) Sodium-dependent dopamine transporter
Name:Sodium-dependent dopamine transporter
Type:Multi-pass membrane protein
Mol. Mass.:68749.45
Organism:Rattus norvegicus (rat)
Description:P23977
Residue:619
BDBM50112273
NameBDBM50112273
Synonyms:Benzoic acid 9-naphthalen-2-ylmethylene-7-aza-tricyclo[4.3.1.0*3,7*]dec-2-ylmethyl ester | CHEMBL294259
TypeSmall organic molecule
Emp. Form.C28H27NO2
Mol. Mass.409.5195
SMILESO=C(OCC1C2CCC3CC1\C(CN23)=C\c1ccc2ccccc2c1)c1ccccc1