Reaction Details
TargetCytochrome P450 2D3
LigandBDBM50366613
Substrate/Competitorn/a
Meas. Tech.ChEMBL_51711 (CHEMBL665726)
IC50 18600±n/a nM
Citation Venhorst, Jter Laak, AMCommandeur, JNFunae, YHiroi, TVermeulen, NP Homology modeling of rat and human cytochrome P450 2D (CYP2D) isoforms and computational rationalization of experimental ligand-binding specificities. J Med Chem46:74-86 (2002) 
 
Cytochrome P450 2D3
Name:Cytochrome P450 2D3
Type:PROTEIN
Mol. Mass.:56643.68
Organism:Rattus norvegicus
Description:ChEMBL_51711
Residue:500
BDBM50366613
NameBDBM50366613
Synonyms:DEXTROMETHORPHAN
TypeSmall organic molecule
Emp. Form.C18H25NO
Mol. Mass.271.3972
SMILESCOc1ccc2C[C@H]3[C@H]4CCCC[C@@]4(CCN3C)c2c1