Reaction Details
TargetCytochrome P450 2D1
LigandBDBM50121975
Substrate/Competitorn/a
Meas. Tech.ChEMBL_51708 (CHEMBL665723)
IC50 19900±n/a nM
Citation Venhorst, Jter Laak, AMCommandeur, JNFunae, YHiroi, TVermeulen, NP Homology modeling of rat and human cytochrome P450 2D (CYP2D) isoforms and computational rationalization of experimental ligand-binding specificities. J Med Chem46:74-86 (2002) 
 
Cytochrome P450 2D1
Name:Cytochrome P450 2D1
Type:PROTEIN
Mol. Mass.:57179.81
Organism:Rattus norvegicus
Description:ChEMBL_51708
Residue:504
BDBM50121975
NameBDBM50121975
Synonyms:(6-Methoxy-quinolin-4-yl)-(5-vinyl-1-aza-bicyclo[2.2.2]oct-2-yl)-methanol CHEMBL1294 DURAQUIN QUINAGLUTE QUINATIME QUINIDINE US9402878, Quinidine
TypeSmall organic molecule
Emp. Form.C20H24N2O2
Mol. Mass.324.4168
SMILESCOc1ccc2nccc([C@H](O)[C@H]3C[C@@H]4CCN3C[C@@H]4C=C)c2c1