Reaction Details
TargetB1 bradykinin receptor
LigandBDBM50370213
Substrate/Competitorn/a
Meas. Tech.ChEMBL_39982 (CHEMBL653556)
Ki 1.37±n/a nM
Citation Wood, MRKim, JJHan, WDorsey, BDHomnick, CFDiPardo, RMKuduk, SDMacNeil, TMurphy, KLLis, EVRansom, RWStump, GLLynch, JJO'Malley, SSMiller, PJChen, TBHarrell, CMChang, RSSandhu, PEllis, JDBondiskey, PJPettibone, DJFreidinger, RMBock, MG Benzodiazepines as potent and selective bradykinin B1 antagonists. J Med Chem46:1803-6 (2003) 
 
B1 bradykinin receptor
Name:B1 bradykinin receptor
Type:Enzyme
Mol. Mass.:40508.87
Organism:Homo sapiens (Human)
Description:P46663
Residue:353
BDBM50370213
NameBDBM50370213
Synonyms:CHEMBL1744083
TypeSmall organic molecule
Emp. Form.C37H46N6O2
Mol. Mass.606.8001
SMILESCCCN1c2ccccc2C(CCc2ccccc2)=N[C@@H](NC(=O)Nc2ccc(cc2)N2CCC(CC2)N2CCCCC2)C1=O