Reaction Details
TargetBeta-secretase 1
LigandBDBM50128036
Substrate/Competitorn/a
Meas. Tech.ChEMBL_39223 (CHEMBL655069)
Ki 22423±n/a nM
Citation Tounge, BAReynolds, CH Calculation of the binding affinity of beta-secretase inhibitors using the linear interaction energy method. J Med Chem46:2074-82 (2003) 
 
Beta-secretase 1
Name:Beta-secretase 1
Type:Protein
Mol. Mass.:55755.10
Organism:Homo sapiens (Human)
Description:P56817
Residue:501
BDBM50128036
NameBDBM50128036
Synonyms:CHEMBL431917 | {1-[4-(1-Benzylcarbamoyl-ethylcarbamoyl)-2-hydroxy-1-isobutyl-pentylcarbamoyl]-2-carbamoyl-ethyl}-carbamic acid tert-butyl ester
TypeSmall organic molecule
Emp. Form.C29H47N5O7
Mol. Mass.577.7128
SMILESCC(C)C[C@H](NC(=O)[C@H](CC(N)=O)NC(=O)OC(C)(C)C)C(O)CC(C)C(=O)NC(C)C(=O)NCc1ccccc1