Reaction Details
TargetBeta-secretase 1
LigandBDBM50128040
Substrate/Competitorn/a
Meas. Tech.ChEMBL_39223 (CHEMBL655069)
Ki 61±n/a nM
Citation Tounge, BAReynolds, CH Calculation of the binding affinity of beta-secretase inhibitors using the linear interaction energy method. J Med Chem46:2074-82 (2003) 
 
Beta-secretase 1
Name:Beta-secretase 1
Type:Protein
Mol. Mass.:55755.10
Organism:Homo sapiens (Human)
Description:P56817
Residue:501
BDBM50128040
NameBDBM50128040
Synonyms:((S)-1-{1-[(S)-4-(1-Benzylcarbamoyl-ethylcarbamoyl)-2-hydroxy-1-isobutyl-pentylcarbamoyl]-2-carbamoyl-ethylcarbamoyl}-2-methyl-propyl)-carbamic acid tert-butyl ester CHEMBL65981
TypeSmall organic molecule
Emp. Form.C34H56N6O8
Mol. Mass.676.8438
SMILESCC(C)C[C@H](NC(=O)C(CC(N)=O)NC(=O)[C@@H](NC(=O)OC(C)(C)C)C(C)C)C(O)CC(C)C(=O)NC(C)C(=O)NCc1ccccc1