Reaction Details
TargetBeta-secretase 1
LigandBDBM50128039
Substrate/Competitorn/a
Meas. Tech.ChEMBL_39223 (CHEMBL655069)
Ki 5808±n/a nM
Citation Tounge, BAReynolds, CH Calculation of the binding affinity of beta-secretase inhibitors using the linear interaction energy method. J Med Chem46:2074-82 (2003) 
 
Beta-secretase 1
Name:Beta-secretase 1
Type:Protein
Mol. Mass.:55755.10
Organism:Homo sapiens (Human)
Description:P56817
Residue:501
BDBM50128039
NameBDBM50128039
Synonyms:CHEMBL66595 {1-[4-(1-Benzylcarbamoyl-2-methyl-propylcarbamoyl)-2-hydroxy-1-isobutyl-pentylcarbamoyl]-3-methylsulfanyl-propyl}-carbamic acid tert-butyl ester
TypeSmall organic molecule
Emp. Form.C32H54N4O6S
Mol. Mass.622.859
SMILESCSCCC(NC(=O)OC(C)(C)C)C(=O)N[C@@H](CC(C)C)C(O)CC(C)C(=O)NC(C(C)C)C(=O)NCc1ccccc1