Reaction Details
TargetBeta-secretase 1
LigandBDBM50128044
Substrate/Competitorn/a
Meas. Tech.ChEMBL_39223 (CHEMBL655069)
Ki 3134±n/a nM
Citation Tounge, BAReynolds, CH Calculation of the binding affinity of beta-secretase inhibitors using the linear interaction energy method. J Med Chem46:2074-82 (2003) 
 
Beta-secretase 1
Name:Beta-secretase 1
Type:Protein
Mol. Mass.:55755.10
Organism:Homo sapiens (Human)
Description:P56817
Residue:501
BDBM50128044
NameBDBM50128044
Synonyms:CHEMBL305381 | {1-[4-(1-Benzylcarbamoyl-2-methyl-propylcarbamoyl)-2-hydroxy-1-isobutyl-pentylcarbamoyl]-2-carbamoyl-ethyl}-carbamic acid tert-butyl ester
TypeSmall organic molecule
Emp. Form.C31H51N5O7
Mol. Mass.605.7659
SMILESCC(C)C[C@H](NC(=O)[C@H](CC(N)=O)NC(=O)OC(C)(C)C)C(O)CC(C)C(=O)NC(C(C)C)C(=O)NCc1ccccc1