Reaction Details
TargetMatrix metalloproteinase-9
LigandBDBM50128610
Substrate/Competitorn/a
Meas. Tech.ChEMBL_105512 (CHEMBL715221)
IC50 0.5±n/a nM
Citation Aranapakam, VGrosu, GTDavis, JMHu, BEllingboe, JBaker, JLSkotnicki, JSZask, ADiJoseph, JFSung, ASharr, MAKillar, LMWalter, TJin, GCowling, R Synthesis and structure-activity relationship of alpha-sulfonylhydroxamic acids as novel, orally active matrix metalloproteinase inhibitors for the treatment of osteoarthritis. J Med Chem46:2361-75 (2003) 
 
Matrix metalloproteinase-9
Name:Matrix metalloproteinase-9
Type:Enzyme
Mol. Mass.:78452.28
Organism:Homo sapiens (Human)
Description:P14780
Residue:707
BDBM50128610
NameBDBM50128610
Synonyms:2-(4-Methoxy-benzenesulfonyl)-4-methylene-2-(2-methylene-but-3-enyl)-hex-5-enoic acid hydroxyamide | CHEMBL310688
TypeSmall organic molecule
Emp. Form.C19H27NO5S
Mol. Mass.381.486
SMILES[#6]-[#8]-c1ccc(cc1)S(=O)(=O)C([#6]\[#6]=[#6](\[#6])-[#6])([#6]\[#6]=[#6](/[#6])-[#6])[#6](=O)-[#7]-[#8]