Reaction Details
TargetSigma non-opioid intracellular receptor 1
LigandBDBM73402
Substrate/Competitorn/a
Meas. Tech.ChEMBL_201910 (CHEMBL808200)
Ki 15.5±n/a nM
Citation Cao, JKulkarni, SSHusbands, SMBowen, WDWilliams, WKopajtic, TKatz, JLGeorge, CNewman, AH Dual probes for the dopamine transporter and sigma1 receptors: novel piperazinyl alkyl-bis(4'-fluorophenyl)amine analogues as potential cocaine-abuse therapeutic agents. J Med Chem46:2589-98 (2003) 
 
Sigma non-opioid intracellular receptor 1
Name:Sigma non-opioid intracellular receptor 1
Type:Enzyme Catalytic Domain
Mol. Mass.:25124.85
Organism:Homo sapiens (Human)
Description:Q99720
Residue:223
BDBM73402
NameBDBM73402
Synonyms:1-Phenyl-cyclopentanecarboxylic acid 2-diethylamino-ethyl ester 1-phenylcyclopentanecarboxylic acid 2-(diethylamino)ethyl ester;hydrochloride 2-(diethylamino)ethyl 1-phenylcyclopentanecarboxylate hydrochloride CHEMBL61946 SMR000140237 | cid_67173
TypeSmall organic molecule
Emp. Form.C18H27NO2
Mol. Mass.289.4125
SMILESCCN(CC)CCOC(=O)C1(CCCC1)c1ccccc1