Reaction Details
TargetSodium-dependent dopamine transporter
LigandBDBM50107087
Substrate/Competitorn/a
Meas. Tech.ChEMBL_62338 (CHEMBL674430)
Ki 22.8±n/a nM
Citation Cao, JKulkarni, SSHusbands, SMBowen, WDWilliams, WKopajtic, TKatz, JLGeorge, CNewman, AH Dual probes for the dopamine transporter and sigma1 receptors: novel piperazinyl alkyl-bis(4'-fluorophenyl)amine analogues as potential cocaine-abuse therapeutic agents. J Med Chem46:2589-98 (2003) 
 
Sodium-dependent dopamine transporter
Name:Sodium-dependent dopamine transporter
Type:Multi-pass membrane protein
Mol. Mass.:68749.45
Organism:Rattus norvegicus (rat)
Description:P23977
Residue:619
BDBM50107087
NameBDBM50107087
Synonyms:CHEMBL313179 {3-[3,5-Dimethyl-4-(3-phenyl-propyl)-piperazin-1-yl]-propyl}-bis-(4-fluoro-phenyl)-amine
TypeSmall organic molecule
Emp. Form.C30H37F2N3
Mol. Mass.477.6317
SMILESC[C@@H]1CN(CCCN(c2ccc(F)cc2)c2ccc(F)cc2)C[C@@H](C)N1CCCc1ccccc1