Reaction Details
TargetSigma non-opioid intracellular receptor 1
LigandBDBM50129592
Substrate/Competitorn/a
Meas. Tech.ChEMBL_201910 (CHEMBL808200)
Ki 13.1±n/a nM
Citation Cao, JKulkarni, SSHusbands, SMBowen, WDWilliams, WKopajtic, TKatz, JLGeorge, CNewman, AH Dual probes for the dopamine transporter and sigma1 receptors: novel piperazinyl alkyl-bis(4'-fluorophenyl)amine analogues as potential cocaine-abuse therapeutic agents. J Med Chem46:2589-98 (2003) 
 
Sigma non-opioid intracellular receptor 1
Name:Sigma non-opioid intracellular receptor 1
Type:Enzyme Catalytic Domain
Mol. Mass.:25124.85
Organism:Homo sapiens (Human)
Description:Q99720
Residue:223
BDBM50129592
NameBDBM50129592
Synonyms:CHEMBL87841 [3-(4-Benzyl-piperazin-1-yl)-propyl]-bis-(4-fluoro-phenyl)-amine
TypeSmall organic molecule
Emp. Form.C26H29F2N3
Mol. Mass.421.5254
SMILESFc1ccc(cc1)N(CCCN1CCN(Cc2ccccc2)CC1)c1ccc(F)cc1