Reaction Details
Target5-hydroxytryptamine receptor 6
LigandBDBM50130268
Substrate/Competitorn/a
Meas. Tech.ChEMBL_3664 (CHEMBL620800)
Ki 3±n/a nM
Citation Glennon, RA Higher-end serotonin receptors: 5-HT(5), 5-HT(6), and 5-HT(7). J Med Chem46:2795-812 (2003) 
 
5-hydroxytryptamine receptor 6
Name:5-hydroxytryptamine receptor 6
Type:G Protein-Coupled Receptor (GPCR)
Mol. Mass.:46968.43
Organism:Homo sapiens (Human)
Description:P50406
Residue:440
BDBM50130268
NameBDBM50130268
Synonyms:CHEMBL329383 N-(2,5-dibromo-3-fluorophenyl)-4-methoxy-3-(piperazin-1-yl)benzenesulfonamide | SB-357134
TypeSmall organic molecule
Emp. Form.C17H18Br2FN3O3S
Mol. Mass.523.215
SMILESCOc1ccc(cc1N1CCNCC1)S(=O)(=O)Nc1cc(Br)cc(F)c1Br