Reaction Details
Target5-hydroxytryptamine receptor 7
LigandBDBM50116963
Substrate/Competitorn/a
Meas. Tech.ChEMBL_3778 (CHEMBL619854)
Ki 2±n/a nM
Citation Glennon, RA Higher-end serotonin receptors: 5-HT(5), 5-HT(6), and 5-HT(7). J Med Chem46:2795-812 (2003) 
 
5-hydroxytryptamine receptor 7
Name:5-hydroxytryptamine receptor 7
Type:G Protein-Coupled Receptor (GPCR)
Mol. Mass.:53573.08
Organism:Homo sapiens (Human)
Description:P34969
Residue:479
BDBM50116963
NameBDBM50116963
Synonyms:2a-(4-(4-phenyl-5,6-dihydropyridin-1(2H)-yl)butyl)-2a,3,4,5-tetrahydrobenzo[cd]indol-2(1H)-one CHEMBL69257
TypeSmall organic molecule
Emp. Form.C26H30N2O
Mol. Mass.386.5292
SMILESO=C1Nc2cccc3CCCC1(CCCCN1CCC(=CC1)c1ccccc1)c23