Reaction Details
Target5-hydroxytryptamine receptor 6
LigandBDBM50130267
Substrate/Competitorn/a
Meas. Tech.ChEMBL_3664 (CHEMBL620800)
Ki 5±n/a nM
Citation Glennon, RA Higher-end serotonin receptors: 5-HT(5), 5-HT(6), and 5-HT(7). J Med Chem46:2795-812 (2003) 
 
5-hydroxytryptamine receptor 6
Name:5-hydroxytryptamine receptor 6
Type:G Protein-Coupled Receptor (GPCR)
Mol. Mass.:46968.43
Organism:Homo sapiens (Human)
Description:P50406
Residue:440
BDBM50130267
NameBDBM50130267
Synonyms:CHEMBL98511 | Octahydro-pyrido[1,2-a]pyrazine
TypeSmall organic molecule
Emp. Form.C8H16N2
Mol. Mass.140.226
SMILESC1CCN2CCNCC2C1