Reaction Details
Target5-hydroxytryptamine receptor 5A
LigandBDBM50017456
Substrate/Competitorn/a
Meas. Tech.ChEMBL_3594 (CHEMBL618079)
Ki 215±n/a nM
Citation Glennon, RA Higher-end serotonin receptors: 5-HT(5), 5-HT(6), and 5-HT(7). J Med Chem46:2795-812 (2003) 
 
5-hydroxytryptamine receptor 5A
Name:5-hydroxytryptamine receptor 5A
Type:Enzyme Catalytic Domain
Mol. Mass.:40749.33
Organism:MOUSE
Description:5-HT5 0 MOUSE::P30966
Residue:357
BDBM50017456
NameBDBM50017456
Synonyms:2-Piperazin-1-yl-phenol EN300-109720
TypeSmall organic molecule
Emp. Form.C10H14N2O
Mol. Mass.178.231
SMILESOc1ccccc1N1CCNCC1